Target
Histidinol dehydrogenase
Ligand
BDBM50267343
Substrate
Meas. Tech.
ChEMBL_436509 (CHEMBL904815)
IC50
16±n/a nM
Citation
 Abdo, MRJoseph, PBoigegrain, RALiautard, JPMontero, JLKöhler, SWinum, JY Brucella suis histidinol dehydrogenase: synthesis and inhibition studies of a series of substituted benzylic ketones derived from histidine. Bioorg Med Chem 15:4427-33 (2007)  
Target
Name:
Histidinol dehydrogenase
Synonyms:
HISX_BRUSU | hisD
Type:
PROTEIN
Mol. Mass.:
46060.70
Organism:
Brucella suis
Description:
ChEMBL_436509
Residue:
430
  
Inhibitor
Name:
BDBM50267343
Synonyms:
(S)-3-amino-4-(1H-imidazol-4-yl)-1-(4-phenoxyphenyl)butan-2-one dihydrochloride | CHEMBL477468
Type:
Small organic molecule
Emp. Form.:
C19H19N3O2
Mol. Mass.:
321.3731
SMILES:
N[C@@H](Cc1cnc[nH]1)C(=O)Cc1ccc(Oc2ccccc2)cc1
: