Target
Histidinol dehydrogenase
Ligand
BDBM50267341
Substrate
Meas. Tech.
ChEMBL_436509 (CHEMBL904815)
IC50
15±n/a nM
Citation
 Abdo, MRJoseph, PBoigegrain, RALiautard, JPMontero, JLKöhler, SWinum, JY Brucella suis histidinol dehydrogenase: synthesis and inhibition studies of a series of substituted benzylic ketones derived from histidine. Bioorg Med Chem 15:4427-33 (2007)  
Target
Name:
Histidinol dehydrogenase
Synonyms:
HISX_BRUSU | hisD
Type:
PROTEIN
Mol. Mass.:
46060.70
Organism:
Brucella suis
Description:
ChEMBL_436509
Residue:
430
  
Inhibitor
Name:
BDBM50267341
Synonyms:
(S)-3-amino-4-(1H-imidazol-4-yl)-1-p-tolylbutan-2-one dihydrochloride | CHEMBL478080
Type:
Small organic molecule
Emp. Form.:
C14H17N3O
Mol. Mass.:
243.3043
SMILES:
Cc1ccc(CC(=O)[C@@H](N)Cc2cnc[nH]2)cc1
: