Target
NF-kappa-B inhibitor alpha
Ligand
BDBM36894
Substrate
Meas. Tech.
ChEMBL_465169 (CHEMBL946815)
EC50
2200±n/a nM
Citation
 Xie, YDeng, SThomas, CJLiu, YZhang, YQRinderspacher, AHuang, WGong, GWyler, MCayanis, EAulner, NTöbben, UChung, CPampou, SSouthall, NVidovic, DSchürer, SBranden, LDavis, REStaudt, LMInglese, JAustin, CPLandry, DWSmith, DHAuld, DS Identification of N-(quinolin-8-yl)benzenesulfonamides as agents capable of down-regulating NFkappaB activity within two separate high-throughput screens of NFkappaB activation. Bioorg Med Chem Lett 18:329-35 (2008)  
Target
Name:
NF-kappa-B inhibitor alpha
Synonyms:
I-kappa-B-alpha IKBA_HUMAN NF-kappa-B inhibitor alpha NFKBIA
Type:
GST fusion protein
Mol. Mass.:
35584.84
Organism:
Homo sapiens (Human)
Description:
It was produced in E. coli as GST-tagged fusion protein (Santa Cruz Biotechnology).
Residue:
317
  
Inhibitor
Name:
BDBM36894
Synonyms:
5H-quinolino[8,7-c][1,2]benzothiazine 6,6-dioxide SMR000040050 | cid_659101
Type:
Small organic molecule
Emp. Form.:
C15H10N2O2S
Mol. Mass.:
282.317
SMILES:
O=S1(=O)Nc2c(ccc3cccnc23)-c2ccccc12
: