Target
NF-kappa-B inhibitor alpha
Ligand
BDBM50372515
Substrate
Meas. Tech.
ChEMBL_465169 (CHEMBL946815)
EC50
8000±n/a nM
Citation
 Xie, YDeng, SThomas, CJLiu, YZhang, YQRinderspacher, AHuang, WGong, GWyler, MCayanis, EAulner, NTöbben, UChung, CPampou, SSouthall, NVidovic, DSchürer, SBranden, LDavis, REStaudt, LMInglese, JAustin, CPLandry, DWSmith, DHAuld, DS Identification of N-(quinolin-8-yl)benzenesulfonamides as agents capable of down-regulating NFkappaB activity within two separate high-throughput screens of NFkappaB activation. Bioorg Med Chem Lett 18:329-35 (2008)  
Target
Name:
NF-kappa-B inhibitor alpha
Synonyms:
I-kappa-B-alpha IKBA_HUMAN NF-kappa-B inhibitor alpha NFKBIA
Type:
GST fusion protein
Mol. Mass.:
35584.84
Organism:
Homo sapiens (Human)
Description:
It was produced in E. coli as GST-tagged fusion protein (Santa Cruz Biotechnology).
Residue:
317
  
Inhibitor
Name:
BDBM50372515
Synonyms:
CHEMBL403333
Type:
Small organic molecule
Emp. Form.:
C16H12N2O3S
Mol. Mass.:
312.343
SMILES:
Cc1ccc2ccc-3c(NS(=O)(=O)c4ccc(O)cc-34)c2n1
: