Target
Cytochrome P450 3A4
Ligand
BDBM50372611
Substrate
Meas. Tech.
ChEMBL_465432 (CHEMBL946016)
IC50
4000±n/a nM
Citation
 Liddle, JAllen, MJBorthwick, ADBrooks, DPDavies, DEEdwards, RMExall, AMHamlett, CIrving, WRMason, AMMcCafferty, GPNerozzi, FPeace, SPhilp, JPollard, DPullen, MAShabbir, SSSollis, SLWestfall, TDWoollard, PMWu, CHickey, DM The discovery of GSK221149A: a potent and selective oxytocin antagonist. Bioorg Med Chem Lett 18:90-4 (2008)  
Target
Name:
Cytochrome P450 3A4
Synonyms:
Albendazole monooxygenase CP3A4_HUMAN CYP3A4 CYPIIIA4 Cytochrome P450 3A4 (CYP3A4) Nifedipine oxidase Taurochenodeoxycholate 6-alpha-hydroxylase
Type:
Enzyme
Mol. Mass.:
57349.57
Organism:
Homo sapiens (Human)
Description:
Residue:
503
  
Inhibitor
Name:
BDBM50372611
Synonyms:
CHEMBL196478
Type:
Small organic molecule
Emp. Form.:
C28H33F2N3O3
Mol. Mass.:
497.5767
SMILES:
CC(C)C[C@H]1N([C@@H](C(=O)NC(C)C)c2ccc(F)cc2F)C(=O)[C@H](NC1=O)C1Cc2ccccc2C1
: