Target
P2Y purinoceptor 1
Ligand
BDBM50373326
Substrate
Meas. Tech.
ChEMBL_467631 (CHEMBL930506)
Ki
0.78±n/a nM
Citation
 Pfefferkorn, JAChoi, CWinters, TKennedy, RChi, LPerrin, LALu, GPing, YWMcClanahan, TSchroeder, RLeininger, MTGeyer, ASchefzick, SAtherton, J P2Y1 receptor antagonists as novel antithrombotic agents. Bioorg Med Chem Lett 18:3338-43 (2008)  
Target
Name:
P2Y purinoceptor 1
Synonyms:
ATP receptor P2RY1_HUMAN P2Y1 Purinergic receptor P2Y1
Type:
Enzyme
Mol. Mass.:
42090.25
Organism:
Homo sapiens (Human)
Description:
P47900
Residue:
373
  
Inhibitor
Name:
BDBM50373326
Synonyms:
CHEMBL444278
Type:
Small organic molecule
Emp. Form.:
C13H18IN5O8P2
Mol. Mass.:
561.1627
SMILES:
CNc1nc(I)nc2n(cnc12)[C@H]1C[C@H](OP(O)(O)=O)[C@]2(COP(O)(O)=O)C[C@H]12
: