Target
Transketolase
Ligand
BDBM50230600
Substrate
Meas. Tech.
ChEMBL_468405 (CHEMBL934305)
EC50
26±n/a nM
Citation
 Thomas, AALe Huerou, YDe Meese, JGunawardana, IKaplan, TRomoff, TTGonzales, SSCondroski, KBoyd, SABallard, JBernat, BDeWolf, WHan, MLee, PLemieux, CPedersen, RPheneger, JPoch, GSmith, DSullivan, FWeiler, SWright, SKLin, JBrandhuber, BVigers, G Synthesis, in vitro and in vivo activity of thiamine antagonist transketolase inhibitors. Bioorg Med Chem Lett 18:2206-10 (2008)  
Target
Name:
Transketolase
Synonyms:
TK TKT_HUMAN
Type:
PROTEIN
Mol. Mass.:
67886.43
Organism:
Homo sapiens (Human)
Description:
ChEMBL_468615
Residue:
623
  
Inhibitor
Name:
BDBM50230600
Synonyms:
3-(2-amino-6-methyl-pyridin-3-ylmethyl)-5-(2-hydroxy-ethyl)-4-methyl-thiazol-3-ium; chloride CHEMBL252086
Type:
Small organic molecule
Emp. Form.:
C13H18N3OS
Mol. Mass.:
264.366
SMILES:
Cc1c(CCO)sc[n+]1Cc1ccc(C)nc1N
: