Target
Transketolase
Ligand
BDBM50373728
Substrate
Meas. Tech.
ChEMBL_468405 (CHEMBL934305)
EC50
360±n/a nM
Citation
 Thomas, AALe Huerou, YDe Meese, JGunawardana, IKaplan, TRomoff, TTGonzales, SSCondroski, KBoyd, SABallard, JBernat, BDeWolf, WHan, MLee, PLemieux, CPedersen, RPheneger, JPoch, GSmith, DSullivan, FWeiler, SWright, SKLin, JBrandhuber, BVigers, G Synthesis, in vitro and in vivo activity of thiamine antagonist transketolase inhibitors. Bioorg Med Chem Lett 18:2206-10 (2008)  
Target
Name:
Transketolase
Synonyms:
TK TKT_HUMAN
Type:
PROTEIN
Mol. Mass.:
67886.43
Organism:
Homo sapiens (Human)
Description:
ChEMBL_468615
Residue:
623
  
Inhibitor
Name:
BDBM50373728
Synonyms:
CHEMBL429246
Type:
Small organic molecule
Emp. Form.:
C13H15N4OS
Mol. Mass.:
275.349
SMILES:
Cc1c(CCO)sc[n+]1Cc1ccc(nc1N)C#N
: