Target
Transketolase
Ligand
BDBM50230588
Substrate
Meas. Tech.
ChEMBL_468405 (CHEMBL934305)
EC50
56±n/a nM
Citation
 Thomas, AALe Huerou, YDe Meese, JGunawardana, IKaplan, TRomoff, TTGonzales, SSCondroski, KBoyd, SABallard, JBernat, BDeWolf, WHan, MLee, PLemieux, CPedersen, RPheneger, JPoch, GSmith, DSullivan, FWeiler, SWright, SKLin, JBrandhuber, BVigers, G Synthesis, in vitro and in vivo activity of thiamine antagonist transketolase inhibitors. Bioorg Med Chem Lett 18:2206-10 (2008)  
Target
Name:
Transketolase
Synonyms:
TK TKT_HUMAN
Type:
PROTEIN
Mol. Mass.:
67886.43
Organism:
Homo sapiens (Human)
Description:
ChEMBL_468615
Residue:
623
  
Inhibitor
Name:
BDBM50230588
Synonyms:
3-(2-amino-6-methyl-pyridin-3-ylmethyl)-5-(2-hydroxy-ethyl)-2,4-dimethyl-thiazol-3-ium; chloride CHEMBL402329
Type:
Small organic molecule
Emp. Form.:
C14H20N3OS
Mol. Mass.:
278.393
SMILES:
Cc1sc(CCO)c(C)[n+]1Cc1ccc(C)nc1N
: