Target
Transketolase
Ligand
BDBM50373743
Substrate
Meas. Tech.
ChEMBL_468405 (CHEMBL934305)
EC50
840±n/a nM
Citation
 Thomas, AALe Huerou, YDe Meese, JGunawardana, IKaplan, TRomoff, TTGonzales, SSCondroski, KBoyd, SABallard, JBernat, BDeWolf, WHan, MLee, PLemieux, CPedersen, RPheneger, JPoch, GSmith, DSullivan, FWeiler, SWright, SKLin, JBrandhuber, BVigers, G Synthesis, in vitro and in vivo activity of thiamine antagonist transketolase inhibitors. Bioorg Med Chem Lett 18:2206-10 (2008)  
Target
Name:
Transketolase
Synonyms:
TK TKT_HUMAN
Type:
PROTEIN
Mol. Mass.:
67886.43
Organism:
Homo sapiens (Human)
Description:
ChEMBL_468615
Residue:
623
  
Inhibitor
Name:
BDBM50373743
Synonyms:
CHEMBL404163
Type:
Small organic molecule
Emp. Form.:
C19H23N4OS
Mol. Mass.:
355.477
SMILES:
Cc1c(CCO)sc(Cc2cccnc2)[n+]1Cc1ccc(C)nc1N
: