Target
Transketolase
Ligand
BDBM50373738
Substrate
Meas. Tech.
ChEMBL_468405 (CHEMBL934305)
EC50
8.7±n/a nM
Citation
 Thomas, AALe Huerou, YDe Meese, JGunawardana, IKaplan, TRomoff, TTGonzales, SSCondroski, KBoyd, SABallard, JBernat, BDeWolf, WHan, MLee, PLemieux, CPedersen, RPheneger, JPoch, GSmith, DSullivan, FWeiler, SWright, SKLin, JBrandhuber, BVigers, G Synthesis, in vitro and in vivo activity of thiamine antagonist transketolase inhibitors. Bioorg Med Chem Lett 18:2206-10 (2008)  
Target
Name:
Transketolase
Synonyms:
TK TKT_HUMAN
Type:
PROTEIN
Mol. Mass.:
67886.43
Organism:
Homo sapiens (Human)
Description:
ChEMBL_468615
Residue:
623
  
Inhibitor
Name:
BDBM50373738
Synonyms:
CHEMBL256627
Type:
Small organic molecule
Emp. Form.:
C14H20N3OS
Mol. Mass.:
278.393
SMILES:
CCc1ccc(C[n+]2csc(CCO)c2C)c(N)n1
: