Target
Protein-arginine deiminase type-4
Ligand
BDBM52947
Substrate
Meas. Tech.
ChEMBL_468734 (CHEMBL929916)
Ki
630000±n/a nM
Citation
 Knuckley, BLuo, YThompson, PR Profiling Protein Arginine Deiminase 4 (PAD4): a novel screen to identify PAD4 inhibitors. Bioorg Med Chem 16:739-45 (2008)  
Target
Name:
Protein-arginine deiminase type-4
Synonyms:
PAD4 PADI4_HUMAN PDI5
Type:
Enzyme Catalytic Domain
Mol. Mass.:
74078.90
Organism:
Homo sapiens (Human)
Description:
gi_216548487
Residue:
663
  
Inhibitor
Name:
BDBM52947
Synonyms:
(2Z,4S,4aR,5S,5aR,6R,12aS)-2-[amino(hydroxy)methylene]-4-(dimethylamino)-5,10,11,12a-tetrahydroxy-6-methyl-4a,5,5a,6-tetrahydro-4H-tetracene-1,3,12-trione;ethanol;hydrate;hydrochloride (2Z,4S,4aR,5S,5aR,6R,12aS)-2-[azanyl(oxidanyl)methylidene]-4-(dimethylamino)-6-methyl-5,10,11,12a-tetrakis(oxidanyl)-4a,5,5a,6-tetrahydro-4H-tetracene-1,3,12-trione;ethanol;hydrate;hydrochloride Doxycycline hyclate SMR000326704 | cid_16746590
Type:
Small organic molecule
Emp. Form.:
C22H24N2O8
Mol. Mass.:
444.4346
SMILES:
C[C@@H]1[C@H]2[C@H](O)[C@H]3[C@H](N(C)C)C(=O)C(C(N)=O)C(=O)[C@@]3(O)C(=O)C2C(=O)c2c(O)cccc12
: