Target
Thyroid hormone receptor alpha
Ligand
BDBM50375349
Substrate
Meas. Tech.
ChEMBL_471200 (CHEMBL939179)
Kd
25±n/a nM
Citation
 Ocasio, CAScanlan, TS Characterization of thyroid hormone receptor alpha (TRalpha)-specific analogs with varying inner- and outer-ring substituents. Bioorg Med Chem 16:762-70 (2008)  
Target
Name:
Thyroid hormone receptor alpha
Synonyms:
C-erbA-alpha EAR7 NR1A1 THA_HUMAN THRA1 Thyroid Hormone Receptor (TR-alpha) Thyroid hormone receptor alpha c-erbA-1
Type:
Receptor
Mol. Mass.:
54818.00
Organism:
Homo sapiens (Human)
Description:
Recombinant hThR was obtained from nuclear extracts from SF9 cells infected with baculovirus vectors encoding for ThRalpha 1.
Residue:
490
  
Inhibitor
Name:
BDBM50375349
Synonyms:
CHEMBL260482
Type:
Small organic molecule
Emp. Form.:
C19H16I2N2O4
Mol. Mass.:
590.1503
SMILES:
Oc1[nH]c(=O)[nH]c1Cc1cc(I)c(Oc2ccc(O)c(c2)C2CC2)c(I)c1
: