Target
Glutamate racemase
Ligand
BDBM26431
Substrate
Meas. Tech.
ChEMBL_475324 (CHEMBL924551)
Ki
5800±n/a nM
Citation
 Lundqvist, TFisher, SLKern, GFolmer, RHXue, YNewton, DTKeating, TAAlm, RAde Jonge, BL Exploitation of structural and regulatory diversity in glutamate racemases. Nature 447:817-822 (2007)  
Target
Name:
Glutamate racemase
Synonyms:
MURI_HELPY murI
Type:
PROTEIN
Mol. Mass.:
28413.39
Organism:
Helicobacter pylori
Description:
ChEMBL_475324
Residue:
255
  
Inhibitor
Name:
BDBM26431
Synonyms:
(2R)-2-aminopentanedioic acid D-Glu D-[14C]Glu
Type:
radiolabeled amino acid
Emp. Form.:
C5H9NO4
Mol. Mass.:
147.1293
SMILES:
N[C@H](CCC(O)=O)C(O)=O
: