Target
Plasmepsin II
Ligand
BDBM50377587
Substrate
Meas. Tech.
ChEMBL_479736 (CHEMBL929233)
IC50
4±n/a nM
Citation
 Azim, MKAhmed, WKhan, IARao, NAKhan, KM Identification of acridinyl hydrazides as potent aspartic protease inhibitors. Bioorg Med Chem Lett 18:3011-5 (2008)  
Target
Name:
Plasmepsin II
Synonyms:
Aspartic hemoglobinase II PLM2_PLAFX Plasmepsin 2 Plasmepsin-II
Type:
Enzyme
Mol. Mass.:
51482.09
Organism:
Plasmodium falciparum
Description:
P46925
Residue:
453
  
Inhibitor
Name:
BDBM50377587
Synonyms:
CHEMBL404394
Type:
Small organic molecule
Emp. Form.:
C23H21N3O
Mol. Mass.:
355.4323
SMILES:
Cc1cccc(c1)C(=O)NNc1c2ccccc2nc2c(C)c(C)ccc12
: