Target
DNA polymerase beta
Ligand
BDBM50292362
Substrate
Meas. Tech.
ChEMBL_503091 (CHEMBL984068)
IC50
>495000±n/a nM
Citation
 Pengsuparp, TSerit, MHughes, SHSoejarto, DDPezzuto, JM Specific inhibition of human immunodeficiency virus type 1 reverse transcriptase mediated by soulattrolide, a coumarin isolated from the latex of calophyllum teysmannii. J Nat Prod 59:839-42 (1997)  
Target
Name:
DNA polymerase beta
Synonyms:
DNA polymerase beta (Pol β) POLB
Type:
Protein
Mol. Mass.:
38188.76
Organism:
Homo sapiens (Human)
Description:
Residue:
335
  
Inhibitor
Name:
BDBM50292362
Synonyms:
CHEMBL466773 | Soulattrolide
Type:
Small organic molecule
Emp. Form.:
C25H24O5
Mol. Mass.:
404.4551
SMILES:
C[C@@H]1Oc2c3C=CC(C)(C)Oc3c3c(cc(=O)oc3c2[C@@H](O)[C@H]1C)-c1ccccc1
: