Target
Plasminogen
Ligand
BDBM50286441
Substrate
Meas. Tech.
ChEMBL_526583 (CHEMBL979307)
IC50
1200±n/a nM
Citation
 Osaki, NKoyano, TKowithayakorn, THayashi, MKomiyama, KIshibashi, M Sesquiterpenoids and plasmin-inhibitory flavonoids from Blumea balsamifera. J Nat Prod 68:447-9 (2005)  
Target
Name:
Plasminogen
Synonyms:
Activation peptide PLG Plasmin Plasmin heavy chain A, short form | Plasmin light chain B
Type:
Enzyme
Mol. Mass.:
90579.18
Organism:
Homo sapiens (Human)
Description:
Residue:
810
  
Inhibitor
Name:
BDBM50286441
Synonyms:
(S)-2-((S)-2-Acetylamino-4-(S)-methyl-pentanoylamino)-4-methyl-pentanoic acid (1-formyl-4-guanidino-butyl)-amide (S)-2-Acetylamino-4-methyl-pentanoic acid [(S)-1-((S)-1-formyl-4-guanidino-butylcarbamoyl)-3-methyl-butyl]-amide (S)-2-acetylamino-4-methyl-pentanoic acid [(S)-2-(1-formyl-4-guanidino-butylamino)-4-methyl-pentanoyl]-amide Ac-LLR-CHO CHEMBL129157
Type:
Small organic molecule
Emp. Form.:
C20H38N6O5
Mol. Mass.:
442.5529
SMILES:
CC(C)C[C@H](NC(C)=O)C(=O)N[C@@H](CC(C)C)C(=O)N[C@@H](CCCNC(N)=N)C(O)=O
: