Target
Nischarin
Ligand
BDBM50027060
Substrate
Meas. Tech.
ChEMBL_490890 (CHEMBL989166)
Ki
99±n/a nM
Citation
 Nikolic, KFilipic, SAgbaba, D QSAR study of imidazoline antihypertensive drugs. Bioorg Med Chem 16:7134-40 (2008)  
Target
Name:
Nischarin
Synonyms:
IRAS Imidazoline receptor 1 (I1R) NISCH Nischarin
Type:
Enzyme
Mol. Mass.:
166571.31
Organism:
Homo sapiens (Human)
Description:
Q9Y2I1
Residue:
1504
  
Inhibitor
Name:
BDBM50027060
Synonyms:
2-(2-Cyclopropyl-phenoxymethyl)-4,5-dihydro-1H-imidazole CHEMBL13852 | CIRAZOLINE
Type:
Small organic molecule
Emp. Form.:
C13H16N2O
Mol. Mass.:
216.2789
SMILES:
C(Oc1ccccc1C1CC1)C1=NCCN1
: