Target
Galectin-3
Ligand
BDBM50272336
Substrate
Meas. Tech.
ChEMBL_510248 (CHEMBL1008161)
IC50
5000000±n/a nM
Citation
 Giguère, DBonin, MACloutier, PPatnam, RSt-Pierre, CSato, SRoy, R Synthesis of stable and selective inhibitors of human galectins-1 and -3. Bioorg Med Chem 16:7811-23 (2008)  
Target
Name:
Galectin-3
Synonyms:
LEG3_HUMAN MAC2
Type:
Enzyme
Mol. Mass.:
26156.54
Organism:
Homo sapiens (Human)
Description:
P17931
Residue:
250
  
Inhibitor
Name:
BDBM50272336
Synonyms:
2-Acetamido-5-(beta-D-galactopyranosyl)-4-methylthiazole | CHEMBL527113
Type:
Small organic molecule
Emp. Form.:
C13H20N2O6S
Mol. Mass.:
332.373
SMILES:
CC(=O)Nc1nc(C)c(C[C@@H]2O[C@H](CO)[C@H](O)[C@H](O)[C@H]2O)s1
: