Target
Diacylglycerol lipase-beta
Ligand
BDBM24567
Substrate
Meas. Tech.
ChEMBL_557688 (CHEMBL962983)
IC50
60±n/a nM
Citation
 Hoover, HSBlankman, JLNiessen, SCravatt, BF Selectivity of inhibitors of endocannabinoid biosynthesis evaluated by activity-based protein profiling. Bioorg Med Chem Lett 18:5838-41 (2008)  
Target
Name:
Diacylglycerol lipase-beta
Synonyms:
DAGLB Sn1-specific diacylglycerol lipase beta
Type:
PROTEIN
Mol. Mass.:
73731.79
Organism:
Homo sapiens (Human)
Description:
ChEMBL_557688
Residue:
672
  
Inhibitor
Name:
BDBM24567
Synonyms:
(2S)-1-[(2S,3S)-3-hexyl-4-oxooxetan-2-yl]tridecan-2-yl (2S)-2-formamido-4-methylpentanoate Orlistat Tetrahydrolipstatin Xenical
Type:
Small organic molecule
Emp. Form.:
C29H53NO5
Mol. Mass.:
495.7348
SMILES:
CCCCCCCCCCC[C@@H](C[C@@H]1OC(=O)[C@H]1CCCCCC)OC(=O)[C@H](CC(C)C)NC=O
: