Target
Dihydrofolate reductase
Ligand
BDBM50051915
Substrate
Meas. Tech.
ChEMBL_538598 (CHEMBL1026636)
IC50
350±n/a nM
Citation
 Gangjee, AAdair, OOPagley, MQueener, SF N9-substituted 2,4-diaminoquinazolines: synthesis and biological evaluation of lipophilic inhibitors of pneumocystis carinii and toxoplasma gondii dihydrofolate reductase. J Med Chem 51:6195-200 (2008)  
Target
Name:
Dihydrofolate reductase
Synonyms:
DYR_RAT Dihydrofolate reductase (DHFR) Tetrahydrofolate dehydrogenase
Type:
Enzyme
Mol. Mass.:
21638.84
Organism:
Rattus norvegicus (rat)
Description:
Residue:
187
  
Inhibitor
Name:
BDBM50051915
Synonyms:
CHEMBL32708 N6-(2,5-dimethoxybenzyl)pyrido[2,3-d]pyrimidine-2,4,6-triamine
Type:
Small organic molecule
Emp. Form.:
C16H18N6O2
Mol. Mass.:
326.3531
SMILES:
COc1ccc(OC)c(CNc2cnc3nc(N)nc(N)c3c2)c1
: