Target
Bifunctional dihydrofolate reductase-thymidylate synthase
Ligand
BDBM50051915
Substrate
Meas. Tech.
ChEMBL_538600 (CHEMBL1027390)
IC50
310±n/a nM
Citation
 Gangjee, AAdair, OOPagley, MQueener, SF N9-substituted 2,4-diaminoquinazolines: synthesis and biological evaluation of lipophilic inhibitors of pneumocystis carinii and toxoplasma gondii dihydrofolate reductase. J Med Chem 51:6195-200 (2008)  
Target
Name:
Bifunctional dihydrofolate reductase-thymidylate synthase
Synonyms:
DHFR-TS Dihydrofolate reductase Dihydrofolate reductase; T. gondii vs rat
Type:
Enzyme
Mol. Mass.:
68757.49
Organism:
Toxoplasma gondii
Description:
Q07422
Residue:
610
  
Inhibitor
Name:
BDBM50051915
Synonyms:
CHEMBL32708 N6-(2,5-dimethoxybenzyl)pyrido[2,3-d]pyrimidine-2,4,6-triamine
Type:
Small organic molecule
Emp. Form.:
C16H18N6O2
Mol. Mass.:
326.3531
SMILES:
COc1ccc(OC)c(CNc2cnc3nc(N)nc(N)c3c2)c1
: