Target
Dihydrofolate reductase
Ligand
BDBM50253612
Substrate
Meas. Tech.
ChEMBL_538596 (CHEMBL1026634)
IC50
38±n/a nM
Citation
 Gangjee, AAdair, OOPagley, MQueener, SF N9-substituted 2,4-diaminoquinazolines: synthesis and biological evaluation of lipophilic inhibitors of pneumocystis carinii and toxoplasma gondii dihydrofolate reductase. J Med Chem 51:6195-200 (2008)  
Target
Name:
Dihydrofolate reductase
Synonyms:
DYR_PNECA Dihydrofolate reductase Tetrahydrofolate dehydrogenase
Type:
Enzyme
Mol. Mass.:
23891.29
Organism:
Pneumocystis carinii
Description:
Residue:
206
  
Inhibitor
Name:
BDBM50253612
Synonyms:
2,4-Diamino-6-[N-(2,5-dimethoxybenzyl)-N-propylamino]quinazoline | CHEMBL492895
Type:
Small organic molecule
Emp. Form.:
C20H25N5O2
Mol. Mass.:
367.4448
SMILES:
CCCN(Cc1cc(OC)ccc1OC)c1ccc2nc(N)nc(N)c2c1
: