Target
Dihydrofolate reductase
Ligand
BDBM50253581
Substrate
Meas. Tech.
ChEMBL_538598 (CHEMBL1026636)
IC50
4.8±n/a nM
Citation
 Gangjee, AAdair, OOPagley, MQueener, SF N9-substituted 2,4-diaminoquinazolines: synthesis and biological evaluation of lipophilic inhibitors of pneumocystis carinii and toxoplasma gondii dihydrofolate reductase. J Med Chem 51:6195-200 (2008)  
Target
Name:
Dihydrofolate reductase
Synonyms:
DYR_RAT Dihydrofolate reductase (DHFR) Tetrahydrofolate dehydrogenase
Type:
Enzyme
Mol. Mass.:
21638.84
Organism:
Rattus norvegicus (rat)
Description:
Residue:
187
  
Inhibitor
Name:
BDBM50253581
Synonyms:
2,4-Diamino-6-[N-(2,5-dimethoxybenzyl)-N-ethylamino]quinazoline | CHEMBL521672
Type:
Small organic molecule
Emp. Form.:
C19H23N5O2
Mol. Mass.:
353.4182
SMILES:
CCN(Cc1cc(OC)ccc1OC)c1ccc2nc(N)nc(N)c2c1
: