Target
Dihydrofolate reductase
Ligand
BDBM50253579
Substrate
Meas. Tech.
ChEMBL_538598 (CHEMBL1026636)
IC50
6.5±n/a nM
Citation
 Gangjee, AAdair, OOPagley, MQueener, SF N9-substituted 2,4-diaminoquinazolines: synthesis and biological evaluation of lipophilic inhibitors of pneumocystis carinii and toxoplasma gondii dihydrofolate reductase. J Med Chem 51:6195-200 (2008)  
Target
Name:
Dihydrofolate reductase
Synonyms:
DYR_RAT Dihydrofolate reductase (DHFR) Tetrahydrofolate dehydrogenase
Type:
Enzyme
Mol. Mass.:
21638.84
Organism:
Rattus norvegicus (rat)
Description:
Residue:
187
  
Inhibitor
Name:
BDBM50253579
Synonyms:
2,4-Diamino-6-[N-(alpha-naphthyl)-N-ethylamino]quinazoline | CHEMBL493718
Type:
Small organic molecule
Emp. Form.:
C21H21N5
Mol. Mass.:
343.4249
SMILES:
CCN(Cc1cccc2ccccc12)c1ccc2nc(N)nc(N)c2c1
: