Target
Dihydrofolate reductase
Ligand
BDBM50051913
Substrate
Meas. Tech.
ChEMBL_538598 (CHEMBL1026636)
IC50
57±n/a nM
Citation
 Gangjee, AAdair, OOPagley, MQueener, SF N9-substituted 2,4-diaminoquinazolines: synthesis and biological evaluation of lipophilic inhibitors of pneumocystis carinii and toxoplasma gondii dihydrofolate reductase. J Med Chem 51:6195-200 (2008)  
Target
Name:
Dihydrofolate reductase
Synonyms:
DYR_RAT Dihydrofolate reductase (DHFR) Tetrahydrofolate dehydrogenase
Type:
Enzyme
Mol. Mass.:
21638.84
Organism:
Rattus norvegicus (rat)
Description:
Residue:
187
  
Inhibitor
Name:
BDBM50051913
Synonyms:
CHEMBL32113 N6-(2,5-DIMETHOXY-BENZYL)-N6-METHYL-PYRIDO[2,3-D]PYRIMIDINE-2,4,6-TRIAMINE | N6-(2,5-dimethoxybenzyl)-N6-methylpyrido[2,3-d]pyrimidine-2,4,6-triamine
Type:
Small organic molecule
Emp. Form.:
C17H20N6O2
Mol. Mass.:
340.3797
SMILES:
COc1ccc(OC)c(CN(C)c2cnc3nc(N)nc(N)c3c2)c1
: