Target
Dihydrofolate reductase
Ligand
BDBM18268
Substrate
Meas. Tech.
ChEMBL_538598 (CHEMBL1026636)
IC50
3±n/a nM
Citation
 Gangjee, AAdair, OOPagley, MQueener, SF N9-substituted 2,4-diaminoquinazolines: synthesis and biological evaluation of lipophilic inhibitors of pneumocystis carinii and toxoplasma gondii dihydrofolate reductase. J Med Chem 51:6195-200 (2008)  
Target
Name:
Dihydrofolate reductase
Synonyms:
DYR_RAT Dihydrofolate reductase (DHFR) Tetrahydrofolate dehydrogenase
Type:
Enzyme
Mol. Mass.:
21638.84
Organism:
Rattus norvegicus (rat)
Description:
Residue:
187
  
Inhibitor
Name:
BDBM18268
Synonyms:
5-methyl-6-{[(3,4,5-trimethoxyphenyl)amino]methyl}quinazoline-2,4-diamine TMQ US11111252, Compound TMQ | US11530198, Example Trimetrexate
Type:
Small organic molecule
Emp. Form.:
C19H23N5O3
Mol. Mass.:
369.4176
SMILES:
COc1cc(NCc2ccc3nc(N)nc(N)c3c2C)cc(OC)c1OC
: