Target
Bifunctional dihydrofolate reductase-thymidylate synthase
Ligand
BDBM50253615
Substrate
Meas. Tech.
ChEMBL_538600 (CHEMBL1027390)
IC50
25±n/a nM
Citation
 Gangjee, AAdair, OOPagley, MQueener, SF N9-substituted 2,4-diaminoquinazolines: synthesis and biological evaluation of lipophilic inhibitors of pneumocystis carinii and toxoplasma gondii dihydrofolate reductase. J Med Chem 51:6195-200 (2008)  
Target
Name:
Bifunctional dihydrofolate reductase-thymidylate synthase
Synonyms:
DHFR-TS Dihydrofolate reductase Dihydrofolate reductase; T. gondii vs rat
Type:
Enzyme
Mol. Mass.:
68757.49
Organism:
Toxoplasma gondii
Description:
Q07422
Residue:
610
  
Inhibitor
Name:
BDBM50253615
Synonyms:
2,4-Diamino-6-[N-(beta-naphthyl)-N-cyclopropyl methylamino]-quinazoline | CHEMBL455012
Type:
Small organic molecule
Emp. Form.:
C23H25N5
Mol. Mass.:
371.4781
SMILES:
CCCCN(Cc1ccc2ccccc2c1)c1ccc2nc(N)nc(N)c2c1
: