Target
Bifunctional dihydrofolate reductase-thymidylate synthase
Ligand
BDBM50253614
Substrate
Meas. Tech.
ChEMBL_538600 (CHEMBL1027390)
IC50
7.3±n/a nM
Citation
 Gangjee, AAdair, OOPagley, MQueener, SF N9-substituted 2,4-diaminoquinazolines: synthesis and biological evaluation of lipophilic inhibitors of pneumocystis carinii and toxoplasma gondii dihydrofolate reductase. J Med Chem 51:6195-200 (2008)  
Target
Name:
Bifunctional dihydrofolate reductase-thymidylate synthase
Synonyms:
DHFR-TS Dihydrofolate reductase Dihydrofolate reductase; T. gondii vs rat
Type:
Enzyme
Mol. Mass.:
68757.49
Organism:
Toxoplasma gondii
Description:
Q07422
Residue:
610
  
Inhibitor
Name:
BDBM50253614
Synonyms:
2,4-Diamino-6-[N-(2,5-dimethoxybenzyl)-N-cyclopropyl methylamino]quinazoline | CHEMBL523004
Type:
Small organic molecule
Emp. Form.:
C21H27N5O2
Mol. Mass.:
381.4714
SMILES:
CCCCN(Cc1cc(OC)ccc1OC)c1ccc2nc(N)nc(N)c2c1
: