Target
Dihydrofolate reductase
Ligand
BDBM50253613
Substrate
Meas. Tech.
ChEMBL_538602 (CHEMBL1027392)
IC50
13±n/a nM
Citation
 Gangjee, AAdair, OOPagley, MQueener, SF N9-substituted 2,4-diaminoquinazolines: synthesis and biological evaluation of lipophilic inhibitors of pneumocystis carinii and toxoplasma gondii dihydrofolate reductase. J Med Chem 51:6195-200 (2008)  
Target
Name:
Dihydrofolate reductase
Synonyms:
Dihydrofolate reductase (DHFR) | Tetrahydrofolate dehydrogenase
Type:
Enzyme
Mol. Mass.:
19884.75
Organism:
Mycobacterium avium
Description:
Recombinant Mycobacterium avium DHFR expressed in E. coli.
Residue:
181
  
Inhibitor
Name:
BDBM50253613
Synonyms:
2,4-Diamino-6-[N-(beta-naphthyl)-N-propylamino]quinazoline | CHEMBL492896
Type:
Small organic molecule
Emp. Form.:
C22H23N5
Mol. Mass.:
357.4515
SMILES:
CCCN(Cc1ccc2ccccc2c1)c1ccc2nc(N)nc(N)c2c1
: