Target
Dihydrofolate reductase
Ligand
BDBM50253611
Substrate
Meas. Tech.
ChEMBL_538602 (CHEMBL1027392)
IC50
14±n/a nM
Citation
 Gangjee, AAdair, OOPagley, MQueener, SF N9-substituted 2,4-diaminoquinazolines: synthesis and biological evaluation of lipophilic inhibitors of pneumocystis carinii and toxoplasma gondii dihydrofolate reductase. J Med Chem 51:6195-200 (2008)  
Target
Name:
Dihydrofolate reductase
Synonyms:
Dihydrofolate reductase (DHFR) | Tetrahydrofolate dehydrogenase
Type:
Enzyme
Mol. Mass.:
19884.75
Organism:
Mycobacterium avium
Description:
Recombinant Mycobacterium avium DHFR expressed in E. coli.
Residue:
181
  
Inhibitor
Name:
BDBM50253611
Synonyms:
2,4-Diamino-6-[N-(2,3,5-trichlorobenzyl)-N-ethylamino]quinazoline | CHEMBL522543
Type:
Small organic molecule
Emp. Form.:
C17H16Cl3N5
Mol. Mass.:
396.701
SMILES:
CCN(Cc1cc(Cl)cc(Cl)c1Cl)c1ccc2nc(N)nc(N)c2c1
: