Target
Dihydrofolate reductase
Ligand
BDBM50253579
Substrate
Meas. Tech.
ChEMBL_538602 (CHEMBL1027392)
IC50
2.9±n/a nM
Citation
 Gangjee, AAdair, OOPagley, MQueener, SF N9-substituted 2,4-diaminoquinazolines: synthesis and biological evaluation of lipophilic inhibitors of pneumocystis carinii and toxoplasma gondii dihydrofolate reductase. J Med Chem 51:6195-200 (2008)  
Target
Name:
Dihydrofolate reductase
Synonyms:
Dihydrofolate reductase (DHFR) | Tetrahydrofolate dehydrogenase
Type:
Enzyme
Mol. Mass.:
19884.75
Organism:
Mycobacterium avium
Description:
Recombinant Mycobacterium avium DHFR expressed in E. coli.
Residue:
181
  
Inhibitor
Name:
BDBM50253579
Synonyms:
2,4-Diamino-6-[N-(alpha-naphthyl)-N-ethylamino]quinazoline | CHEMBL493718
Type:
Small organic molecule
Emp. Form.:
C21H21N5
Mol. Mass.:
343.4249
SMILES:
CCN(Cc1cccc2ccccc12)c1ccc2nc(N)nc(N)c2c1
: