Target
Glutamate receptor 4
Ligand
BDBM50252922
Substrate
Meas. Tech.
ChEMBL_539474 (CHEMBL1028970)
Ki
804±n/a nM
Citation
 Butini, SPickering, DSMorelli, ECoccone, SSTrotta, FDe Angelis, MGuarino, EFiorini, ICampiani, GNovellino, ESchousboe, AChristensen, JKGemma, S 1H-cyclopentapyrimidine-2,4(1H,3H)-dione-related ionotropic glutamate receptors ligands. structure-activity relationships and identification of potent and Selective iGluR5 modulators. J Med Chem 51:6614-8 (2008)  
Target
Name:
Glutamate receptor 4
Synonyms:
GRIA4_RAT Glutamate receptor ionotropic, AMPA 4 Gria4
Type:
PROTEIN
Mol. Mass.:
100766.57
Organism:
Rattus norvegicus
Description:
ChEMBL_539474
Residue:
902
  
Inhibitor
Name:
BDBM50252922
Synonyms:
(S)-1-(2'-Amino-2'-carboxyethyl)thieno[3,2-d]pyrimidin-2,4-dione | CHEMBL492630
Type:
Small organic molecule
Emp. Form.:
C9H9N3O4S
Mol. Mass.:
255.25
SMILES:
N[C@@H](Cn1c2ccsc2c(=O)[nH]c1=O)C(O)=O
: