Target
Glutamate receptor 4
Ligand
BDBM50252921
Substrate
Meas. Tech.
ChEMBL_539474 (CHEMBL1028970)
Ki
1590±n/a nM
Citation
 Butini, SPickering, DSMorelli, ECoccone, SSTrotta, FDe Angelis, MGuarino, EFiorini, ICampiani, GNovellino, ESchousboe, AChristensen, JKGemma, S 1H-cyclopentapyrimidine-2,4(1H,3H)-dione-related ionotropic glutamate receptors ligands. structure-activity relationships and identification of potent and Selective iGluR5 modulators. J Med Chem 51:6614-8 (2008)  
Target
Name:
Glutamate receptor 4
Synonyms:
GRIA4_RAT Glutamate receptor ionotropic, AMPA 4 Gria4
Type:
PROTEIN
Mol. Mass.:
100766.57
Organism:
Rattus norvegicus
Description:
ChEMBL_539474
Residue:
902
  
Inhibitor
Name:
BDBM50252921
Synonyms:
(S)-1-(2'-Amino-2'-carboxyethyl)-6,6-dimethyl-2,3,4,5,6,7-hexahydrocyclopentapyrimidin-2,4-dione | CHEMBL492629
Type:
Small organic molecule
Emp. Form.:
C12H17N3O4
Mol. Mass.:
267.2811
SMILES:
CC1(C)Cc2c(C1)c(=O)[nH]c(=O)n2C[C@H](N)C(O)=O
: