Target
Glutamate receptor 4
Ligand
BDBM50252873
Substrate
Meas. Tech.
ChEMBL_539474 (CHEMBL1028970)
Ki
656±n/a nM
Citation
 Butini, SPickering, DSMorelli, ECoccone, SSTrotta, FDe Angelis, MGuarino, EFiorini, ICampiani, GNovellino, ESchousboe, AChristensen, JKGemma, S 1H-cyclopentapyrimidine-2,4(1H,3H)-dione-related ionotropic glutamate receptors ligands. structure-activity relationships and identification of potent and Selective iGluR5 modulators. J Med Chem 51:6614-8 (2008)  
Target
Name:
Glutamate receptor 4
Synonyms:
GRIA4_RAT Glutamate receptor ionotropic, AMPA 4 Gria4
Type:
PROTEIN
Mol. Mass.:
100766.57
Organism:
Rattus norvegicus
Description:
ChEMBL_539474
Residue:
902
  
Inhibitor
Name:
BDBM50252873
Synonyms:
2-amino-3-(5-bromo-2,4-dioxo-3,4-dihydropyrimidin-1(2H)-yl)propanoic acid | CHEMBL449296
Type:
Small organic molecule
Emp. Form.:
C7H8BrN3O4
Mol. Mass.:
278.06
SMILES:
NC(Cn1cc(Br)c(=O)[nH]c1=O)C(O)=O
: