Target
Delta-type opioid receptor
Ligand
BDBM50278436
Substrate
Meas. Tech.
ChEMBL_565193 (CHEMBL958399)
IC50
0.080000±n/a nM
Citation
 Wentland, MPLou, RLu, QBu, YDenhardt, CJin, JGanorkar, RVanAlstine, MAGuo, CCohen, DJBidlack, JM Syntheses of novel high affinity ligands for opioid receptors. Bioorg Med Chem Lett 19:2289-94 (2009)  
Target
Name:
Delta-type opioid receptor
Synonyms:
D-OR-1 Delta opioid receptor OPIATE Delta OPRD1 OPRK1 | opioid receptor, delta 1
Type:
G Protein-Coupled Receptor (GPCR)
Mol. Mass.:
40382.98
Organism:
Homo sapiens (Human)
Description:
Competition binding assays were carried out using membrane preparations from transfected HN9.10 cells that constitutively expressed the delta opioid receptor.
Residue:
372
  
Inhibitor
Name:
BDBM50278436
Synonyms:
(1R,13S,14R)-24-(cyclopropylmethyl)-13,20-dihydroxy-4,24-diazahexacyclo[12.7.3.0^{1,13}.0^{3,11}.0^{5,10}.0^{16,21}]tetracosa-3(11),5(10),6,8,16(21),17,19-heptaene-19-carboxamide | CHEMBL469815
Type:
Small organic molecule
Emp. Form.:
C27H29N3O3
Mol. Mass.:
443.5375
SMILES:
NC(=O)c1ccc2C[C@H]3N(CC4CC4)CC[C@@]4(Cc5[nH]c6ccccc6c5C[C@@]34O)c2c1O
: