Target
Smoothened homolog
Ligand
BDBM50232973
Substrate
Meas. Tech.
ChEMBL_540453 (CHEMBL1029070)
IC50
1200±n/a nM
Citation
 Peukert, SJain, RKGeisser, ASun, YZhang, RBourret, ACarlson, ADasilva, JRamamurthy, AKelleher, JF Identification and structure-activity relationships of ortho-biphenyl carboxamides as potent Smoothened antagonists inhibiting the Hedgehog signaling pathway. Bioorg Med Chem Lett 19:328-31 (2008)  
Target
Name:
Smoothened homolog
Synonyms:
SMO_MOUSE Smoh
Type:
PROTEIN
Mol. Mass.:
87472.73
Organism:
Mus musculus
Description:
ChEMBL_1510377
Residue:
793
  
Inhibitor
Name:
BDBM50232973
Synonyms:
CHEMBL254129 | CYCLOPAMINE
Type:
Small organic molecule
Emp. Form.:
C27H41NO2
Mol. Mass.:
411.6199
SMILES:
C[C@@H]1[C@@H]2NC[C@@H](C)C[C@H]2O[C@]11CC[C@H]2[C@@H]3CC=C4C[C@@H](O)CC[C@]4(C)[C@H]3CC2=C1C
: