Target
Mitogen-activated protein kinase kinase kinase 4
Ligand
BDBM13216
Substrate
Meas. Tech.
ChEMBL_586696 (CHEMBL1062844)
Kd
310±n/a nM
Citation
 Karaman, MWHerrgard, STreiber, DKGallant, PAtteridge, CECampbell, BTChan, KWCiceri, PDavis, MIEdeen, PTFaraoni, RFloyd, MHunt, JPLockhart, DJMilanov, ZVMorrison, MJPallares, GPatel, HKPritchard, SWodicka, LMZarrinkar, PP A quantitative analysis of kinase inhibitor selectivity. Nat Biotechnol 26:127-32 (2008)  
Target
Name:
Mitogen-activated protein kinase kinase kinase 4
Synonyms:
KIAA0213 MAP three kinase 1 MAPK/ERK kinase kinase 4 MEK kinase 4 MEKK4 Mitogen-activated protein kinase kinase kinase 4
Type:
PROTEIN
Mol. Mass.:
181676.15
Organism:
Homo sapiens (Human)
Description:
ChEMBL_774507
Residue:
1608
  
Inhibitor
Name:
BDBM13216
Synonyms:
BMS-354825 DASATINIB N-(2-chloro-6-methylphenyl)-2-({6-[4-(2-hydroxyethyl)piperazin-1-yl]-2-methylpyrimidin-4-yl}amino)-1,3-thiazole-5-carboxamide US20230348453, Compound A8 med.21724, Compound Dasatinib
Type:
Small organic molecule
Emp. Form.:
C22H26ClN7O2S
Mol. Mass.:
488.006
SMILES:
Cc1nc(Nc2ncc(s2)C(=O)Nc2c(C)cccc2Cl)cc(n1)N1CCN(CCO)CC1
: