Target
Calcium/calmodulin-dependent protein kinase type II subunit beta
Ligand
BDBM5655
Substrate
Meas. Tech.
ChEMBL_586560 (CHEMBL1060183)
Kd
>10000±n/a nM
Citation
 Karaman, MWHerrgard, STreiber, DKGallant, PAtteridge, CECampbell, BTChan, KWCiceri, PDavis, MIEdeen, PTFaraoni, RFloyd, MHunt, JPLockhart, DJMilanov, ZVMorrison, MJPallares, GPatel, HKPritchard, SWodicka, LMZarrinkar, PP A quantitative analysis of kinase inhibitor selectivity. Nat Biotechnol 26:127-32 (2008)  
Target
Name:
Calcium/calmodulin-dependent protein kinase type II subunit beta
Synonyms:
CAM2 CAMK2B CaM kinase II CaM kinase II subunit beta CaMK-II subunit beta Calcium/calmodulin-dependent protein kinase type II beta chain | KCC2B_HUMAN
Type:
Enzyme Catalytic Domain
Mol. Mass.:
72685.48
Organism:
Homo sapiens (Human)
Description:
gi_26051204
Residue:
666
  
Inhibitor
Name:
BDBM5655
Synonyms:
2-(2-chlorophenyl)-5,7-dihydroxy-8-[(3S,4R)-3-hydroxy-1-methylpiperidin-4-yl]-4H-chromen-4-one Flavopiridol US9617225, Flavopiridol
Type:
Small organic molecule
Emp. Form.:
C21H20ClNO5
Mol. Mass.:
401.84
SMILES:
CN1CC[C@@H]([C@H](O)C1)c1c(O)cc(O)c2c1oc(cc2=O)-c1ccccc1Cl
: