Target
Calcium/calmodulin-dependent protein kinase type II subunit beta
Ligand
BDBM5447
Substrate
Meas. Tech.
ChEMBL_586560 (CHEMBL1060183)
Kd
>10000±n/a nM
Citation
 Karaman, MWHerrgard, STreiber, DKGallant, PAtteridge, CECampbell, BTChan, KWCiceri, PDavis, MIEdeen, PTFaraoni, RFloyd, MHunt, JPLockhart, DJMilanov, ZVMorrison, MJPallares, GPatel, HKPritchard, SWodicka, LMZarrinkar, PP A quantitative analysis of kinase inhibitor selectivity. Nat Biotechnol 26:127-32 (2008)  
Target
Name:
Calcium/calmodulin-dependent protein kinase type II subunit beta
Synonyms:
CAM2 CAMK2B CaM kinase II CaM kinase II subunit beta CaMK-II subunit beta Calcium/calmodulin-dependent protein kinase type II beta chain | KCC2B_HUMAN
Type:
Enzyme Catalytic Domain
Mol. Mass.:
72685.48
Organism:
Homo sapiens (Human)
Description:
gi_26051204
Residue:
666
  
Inhibitor
Name:
BDBM5447
Synonyms:
CHEMBL939 Iressa N-(3-chloro-4-fluorophenyl)-7-methoxy-6-[3-(morpholin-4-yl)propoxy]quinazolin-4-amine US10507209, Compound Gefitinib US9730934, Gefitinib WO2022090481, Example gefitinib cid_123631
Type:
Small organic molecule
Emp. Form.:
C22H24ClFN4O3
Mol. Mass.:
446.902
SMILES:
COc1cc2ncnc(Nc3ccc(F)c(Cl)c3)c2cc1OCCCN1CCOCC1
: