Target
5-hydroxytryptamine receptor 3A
Ligand
BDBM50060685
Substrate
Meas. Tech.
ChEMBL_592422 (CHEMBL1037808)
Kd
64.57±n/a nM
Citation
 Butini, SBudriesi, RHamon, MMorelli, EGemma, SBrindisi, MBorrelli, GNovellino, EFiorini, IIoan, PChiarini, ACagnotto, AMennini, TFracasso, CCaccia, SCampiani, G Novel, potent, and selective quinoxaline-based 5-HT(3) receptor ligands. 1. Further structure-activity relationships and pharmacological characterization. J Med Chem 52:6946-50 (2009)  
Target
Name:
5-hydroxytryptamine receptor 3A
Synonyms:
5-HT3 5HT3A_CAVPO HTR3 Serotonin 3a (5-HT3a) receptor
Type:
Enzyme Catalytic Domain
Mol. Mass.:
55657.07
Organism:
GUINEA PIG
Description:
5-HT3 HTR3A GUINEA PIG::O70212
Residue:
490
  
Inhibitor
Name:
BDBM50060685
Synonyms:
9-Fluoro-4-(4-methyl-piperazin-1-yl)-pyrrolo[1,2-a]quinoxaline CHEMBL124886
Type:
Small organic molecule
Emp. Form.:
C16H17FN4
Mol. Mass.:
284.3314
SMILES:
CN1CCN(CC1)c1nc2cccc(F)c2n2cccc12
: