Target
Cyclin-A1/Cyclin-A2/Cyclin-dependent kinase 2
Ligand
BDBM50378317
Substrate
Meas. Tech.
ChEMBL_589414 (CHEMBL1058435)
IC50
0.50±n/a nM
Citation
 Trova, MPBarnes, KDAlicea, LBenanti, TBielaska, MBilotta, JBliss, BDuong, TNHaydar, SHerr, RJHui, YJohnson, MLehman, JMPeace, DRainka, MSnider, PSalamone, STregay, SZheng, XFriedrich, TD Heterobiaryl purine derivatives as potent antiproliferative agents: inhibitors of cyclin dependent kinases. Part II. Bioorg Med Chem Lett 19:6613-7 (2009)  
Target
Name:
Cyclin-A1/Cyclin-A2/Cyclin-dependent kinase 2
Synonyms:
CDK2/Cyclin A/Cyclin A1 Cyclin-dependent kinase 2/cyclin A
Type:
Mol. Mass.:
Description:
ASSAY_ID of EBI is 42813
Components:
This complex has 3 components.
Component 1
Name:
Cyclin-A2
Synonyms:
CCN1 CCNA1 CCNA2_HUMAN Cyclin-A
Type:
Enzyme Subunit
Mol. Mass.:
48550.19
Organism:
Homo sapiens (Human)
Description:
P20248
Residue:
432
  
Component 2
Name:
Cyclin-A1
Synonyms:
CCNA1 CDK2/Cyclin A1 Cyclin-A1/Cyclin-dependent kinase 4
Type:
Enzyme
Mol. Mass.:
52343.37
Organism:
Homo sapiens (Human)
Description:
P78396
Residue:
465
  
Component 3
Name:
Cyclin-dependent kinase 2
Synonyms:
CDK2 CDK2_HUMAN Cell division protein kinase 2 Protein cereblon/Cyclin-dependent kinase 2 | p33 protein kinase
Type:
Enzyme Subunit
Mol. Mass.:
33938.17
Organism:
Homo sapiens (Human)
Description:
P24941
Residue:
298
  
Component 4
Name:
Cyclin-A2
Synonyms:
CCN1 CCNA1 CCNA2_HUMAN Cyclin-A
Type:
Enzyme Subunit
Mol. Mass.:
48550.19
Organism:
Homo sapiens (Human)
Description:
P20248
Residue:
432
  
Inhibitor
Name:
BDBM50378317
Synonyms:
CHEMBL565273
Type:
Small organic molecule
Emp. Form.:
C26H32N8
Mol. Mass.:
456.5859
SMILES:
CC(C)n1cnc2c(NCc3ccc(cn3)-c3ccccc3)nc(N[C@H]3CC[C@H](N)CC3)nc12
: