Target
Caspase-2
Ligand
BDBM50302107
Substrate
Meas. Tech.
ChEMBL_600038 (CHEMBL1039231)
IC50
5000±n/a nM
Citation
 Kwan, JCEksioglu, EALiu, CPaul, VJLuesch, H Grassystatins A-C from marine cyanobacteria, potent cathepsin E inhibitors that reduce antigen presentation. J Med Chem 52:5732-47 (2009)  
Target
Name:
Caspase-2
Synonyms:
CASP-2 CASP2_HUMAN Caspase-2 subunit p13 ICH-1 protease ICH1 NEDD2 | Neural precursor cell expressed developmentally down-regulated protein 2
Type:
Enzyme
Mol. Mass.:
50688.29
Organism:
Homo sapiens (Human)
Description:
P42575
Residue:
452
  
Inhibitor
Name:
BDBM50302107
Synonyms:
CHEMBL567893 | Grassystatin A
Type:
Small organic molecule
Emp. Form.:
C58H95N9O16
Mol. Mass.:
1174.4256
SMILES:
COC(=O)[C@@H]1CCCN1C(=O)[C@@H](Cc1ccccc1)N(C)C(=O)[C@H](C)NC(=O)[C@@H](NC(=O)C[C@H](O)[C@H](CC(C)C)NC(=O)[C@H](CC(N)=O)NC(=O)[C@H](CC(C)C)NC(=O)[C@H](OC(=O)[C@@H](OC(=O)[C@H](C(C)C)N(C)C)C(C)C)C(C)C)[C@@H](C)O
: