Target
Caspase-4
Ligand
BDBM50302107
Substrate
Meas. Tech.
ChEMBL_600047 (CHEMBL1039240)
IC50
5000±n/a nM
Citation
 Kwan, JCEksioglu, EALiu, CPaul, VJLuesch, H Grassystatins A-C from marine cyanobacteria, potent cathepsin E inhibitors that reduce antigen presentation. J Med Chem 52:5732-47 (2009)  
Target
Name:
Caspase-4
Synonyms:
CASP-11 CASP4_MOUSE Casp4 Caspase-4 subunit p10 Caspl Protease ICH-3
Type:
PROTEIN
Mol. Mass.:
42745.52
Organism:
Mus musculus
Description:
ChEMBL_600047
Residue:
373
  
Inhibitor
Name:
BDBM50302107
Synonyms:
CHEMBL567893 | Grassystatin A
Type:
Small organic molecule
Emp. Form.:
C58H95N9O16
Mol. Mass.:
1174.4256
SMILES:
COC(=O)[C@@H]1CCCN1C(=O)[C@@H](Cc1ccccc1)N(C)C(=O)[C@H](C)NC(=O)[C@@H](NC(=O)C[C@H](O)[C@H](CC(C)C)NC(=O)[C@H](CC(N)=O)NC(=O)[C@H](CC(C)C)NC(=O)[C@H](OC(=O)[C@@H](OC(=O)[C@H](C(C)C)N(C)C)C(C)C)C(C)C)[C@@H](C)O
: