Target
Mitogen-activated protein kinase kinase kinase kinase 2
Ligand
BDBM50378568
Substrate
Meas. Tech.
ChEMBL_597779 (CHEMBL1046257)
IC50
24±n/a nM
Citation
 Moy, FJLee, AGavrin, LKXu, ZBSievers, AKieras, EStochaj, WMosyak, LMcKew, JTsao, DH Novel synthesis and structural characterization of a high-affinity paramagnetic kinase probe for the identification of non-ATP site binders by nuclear magnetic resonance. J Med Chem 53:1238-49 (2010)  
Target
Name:
Mitogen-activated protein kinase kinase kinase kinase 2
Synonyms:
2.7.11.1 GC kinase Germinal center kinase MAP4K2 MEK kinase kinase 2 RAB8IP | Rab8-interacting protein
Type:
Mol. Mass.:
91551.35
Organism:
Homo sapiens (Human)
Description:
Residue:
820
  
Inhibitor
Name:
BDBM50378568
Synonyms:
CHEMBL1163016
Type:
Small organic molecule
Emp. Form.:
C28H31N6O3
Mol. Mass.:
499.5841
SMILES:
CC1(C)CC(CC(C)(C)N1[O])NC(=O)c1cccc(c1)-c1cc2nccc(Nc3cccc(O)c3)n2n1
: