Target
Protein kinase C delta type
Ligand
BDBM50307104
Substrate
Meas. Tech.
ChEMBL_609373 (CHEMBL1072759)
EC50
8980±n/a nM
Citation
 Majhi, ARahman, GMPanchal, SDas, J Binding of curcumin and its long chain derivatives to the activator binding domain of novel protein kinase C. Bioorg Med Chem 18:1591-8 (2010)  
Target
Name:
Protein kinase C delta type
Synonyms:
KPCD_HUMAN PKCD Protein Kinase C- delta nPKC-delta
Type:
Enzyme
Mol. Mass.:
77516.79
Organism:
Homo sapiens (Human)
Description:
The recombinant human PKC enzymes were produced using a baculovirus expression system in SF9 cells
Residue:
676
  
Inhibitor
Name:
BDBM50307104
Synonyms:
(1E,4Z,6E)-5-Hydroxy-1,7-bis(3-methoxy-4-(octyloxy)phenyl)-hepta-1,4,6-trien-3-one | CHEMBL589364
Type:
Small organic molecule
Emp. Form.:
C37H52O6
Mol. Mass.:
592.8052
SMILES:
CCCCCCCCCCCCCCCCOc1ccc(C=CC(=O)CC(=O)C=Cc2ccc(O)c(OC)c2)cc1OC
: