Target
Protein kinase C delta type
Ligand
BDBM50015677
Substrate
Meas. Tech.
ChEMBL_609373 (CHEMBL1072759)
EC50
16150±n/a nM
Citation
 Majhi, ARahman, GMPanchal, SDas, J Binding of curcumin and its long chain derivatives to the activator binding domain of novel protein kinase C. Bioorg Med Chem 18:1591-8 (2010)  
Target
Name:
Protein kinase C delta type
Synonyms:
KPCD_HUMAN PKCD Protein Kinase C- delta nPKC-delta
Type:
Enzyme
Mol. Mass.:
77516.79
Organism:
Homo sapiens (Human)
Description:
The recombinant human PKC enzymes were produced using a baculovirus expression system in SF9 cells
Residue:
676
  
Inhibitor
Name:
BDBM50015677
Synonyms:
(S)-1-hydroxymethyl-2-octanoyloxy-ethyl ester 1,2-dioctanoyl-sn-glycerol Octanoic acid 1-hydroxymethyl-2-octanoyloxy-ethyl ester | Octanoic acid 1-hydroxymethyl-2-octanoyloxy-ethyl ester(diC8)
Type:
Small organic molecule
Emp. Form.:
C19H36O5
Mol. Mass.:
344.4861
SMILES:
CCCCCCCC(=O)OC[C@H](CO)OC(=O)CCCCCCC
: