Target
Protein kinase C delta type
Ligand
BDBM50307105
Substrate
Meas. Tech.
ChEMBL_609373 (CHEMBL1072759)
EC50
7490±n/a nM
Citation
 Majhi, ARahman, GMPanchal, SDas, J Binding of curcumin and its long chain derivatives to the activator binding domain of novel protein kinase C. Bioorg Med Chem 18:1591-8 (2010)  
Target
Name:
Protein kinase C delta type
Synonyms:
KPCD_HUMAN PKCD Protein Kinase C- delta nPKC-delta
Type:
Enzyme
Mol. Mass.:
77516.79
Organism:
Homo sapiens (Human)
Description:
The recombinant human PKC enzymes were produced using a baculovirus expression system in SF9 cells
Residue:
676
  
Inhibitor
Name:
BDBM50307105
Synonyms:
1,2-dioleoyl-sn-glycerol | CHEMBL590047
Type:
Small organic molecule
Emp. Form.:
C39H72O5
Mol. Mass.:
620.986
SMILES:
CCCCCCCC\C=C/CCCCCCCC(=O)OC[C@H](CO)OC(=O)CCCCCCC\C=C/CCCCCCCC
: