Target
Vitamin D3 receptor
Ligand
BDBM50200182
Substrate
Meas. Tech.
ChEMBL_622878 (CHEMBL1116617)
Kd
0.070±n/a nM
Citation
 Sánchez-Abella, LFernández, SVerstuyf, AVerlinden, LGotor, VFerrero, M Synthesis, conformational analysis, and biological evaluation of 19-nor-vitamin D3 analogues with A-ring modifications. J Med Chem 52:6158-62 (2009)  
Target
Name:
Vitamin D3 receptor
Synonyms:
NR1I1 VDR_PIG
Type:
PROTEIN
Mol. Mass.:
48124.90
Organism:
Sus scrofa
Description:
ChEMBL_622878
Residue:
427
  
Inhibitor
Name:
BDBM50200182
Synonyms:
(1S,3R,5Z,7E)-9,10-secocholesta-5,7,10(19)-triene-1,3,25-triol (1alpha,3beta,5Z,7E)-9,10-secocholesta-5,7,10(19)-triene-1,3,25-triol 1,25-DHCC 1alpha,25-dihydroxycholecalciferol CALCITRIOL | CHEMBL846
Type:
Small organic molecule
Emp. Form.:
C27H44O3
Mol. Mass.:
416.6365
SMILES:
C[C@H](CCCC(C)(C)O)[C@H]1CC[C@H]2\C(CCC[C@]12C)=C\C=C1\C[C@@H](O)C[C@H](O)C1=C
: