Target
Cyclin-dependent kinase 18 [3-474]
Ligand
BDBM50312990
Substrate
Meas. Tech.
ChEMBL_616135 (CHEMBL1102998)
Kd
110±n/a nM
Citation
 Gong, LHirschfeld, DTan, YCHeather Hogg, JPeltz, GAvnur, ZDunten, P Discovery of potent and bioavailable GSK-3beta inhibitors. Bioorg Med Chem Lett 20:1693-6 (2010)  
Target
Name:
Cyclin-dependent kinase 18 [3-474]
Synonyms:
CDK18 PCTAIRE3 Serine/threonine-protein kinase PCTAIRE-3
Type:
PROTEIN
Mol. Mass.:
54193.55
Organism:
Homo sapiens (Human)
Description:
ChEMBL_774354
Residue:
472
  
Inhibitor
Name:
BDBM50312990
Synonyms:
(R,S)-3-(3-(2,3-dihydroxypropylamino)phenyl)-4-(5-fluoro-1-methyl-1H-indol-3-yl)-1H-pyrrole-2,5-dione | CHEMBL1082152
Type:
Small organic molecule
Emp. Form.:
C22H20FN3O4
Mol. Mass.:
409.4103
SMILES:
Cn1cc(C2=C(C(=O)NC2=O)c2cccc(NCC(O)CO)c2)c2cc(F)ccc12
: